Reaction Details
TargetCytochrome P450 2C9
LigandBDBM50168397
Substrate/Competitorn/a
Meas. Tech.ChEMBL_311624 (CHEMBL833935)
IC50 3600±n/a nM
Citation Borzilleri, RMZheng, XQian, LEllis, CCai, ZWWautlet, BSMortillo, SJeyaseelan, RKukral, DWFura, AKamath, AVyas, VTokarski, JSBarrish, JCHunt, JTLombardo, LJFargnoli, JBhide, RS Design, synthesis, and evaluation of orally active 4-(2,4-difluoro-5-(methoxycarbamoyl)phenylamino)pyrrolo[2,1-f][1,2,4]triazines as dual vascular endothelial growth factor receptor-2 and fibroblast growth factor receptor-1 inhibitors. J Med Chem48:3991-4008 (2005) 
 
Cytochrome P450 2C9
Name:Cytochrome P450 2C9
Type:Enzyme
Mol. Mass.:55636.33
Organism:Homo sapiens (Human)
Description:P11712
Residue:490
BDBM50168397
NameBDBM50168397
Synonyms:2,4-Difluoro-5-[5-isopropyl-6-(5-methyl-oxazol-2-yl)-pyrrolo[2,1-f][1,2,4]triazin-4-ylamino]-N-methoxy-benzamide CHEMBL193306 | KDR Kinase Inhibitor, 8
TypeSmall organic molecule
Emp. Form.C21H20F2N6O3
Mol. Mass.442.4187
SMILESCONC(=O)c1cc(Nc2ncnn3cc(-c4ncc(C)o4)c(C(C)C)c23)c(F)cc1F