Reaction Details
TargetPlatelet-derived growth factor receptor beta
LigandBDBM50168403
Substrate/Competitorn/a
Meas. Tech.ChEMBL_305323 (CHEMBL833545)
IC50>2000±n/a nM
Citation Borzilleri, RMZheng, XQian, LEllis, CCai, ZWWautlet, BSMortillo, SJeyaseelan, RKukral, DWFura, AKamath, AVyas, VTokarski, JSBarrish, JCHunt, JTLombardo, LJFargnoli, JBhide, RS Design, synthesis, and evaluation of orally active 4-(2,4-difluoro-5-(methoxycarbamoyl)phenylamino)pyrrolo[2,1-f][1,2,4]triazines as dual vascular endothelial growth factor receptor-2 and fibroblast growth factor receptor-1 inhibitors. J Med Chem48:3991-4008 (2005) 
 
Platelet-derived growth factor receptor beta
Name:Platelet-derived growth factor receptor beta
Type:Enzyme
Mol. Mass.:123922.25
Organism:Homo sapiens (Human)
Description:P09619
Residue:1106
BDBM50168403
NameBDBM50168403
Synonyms:5-[6-(5-Difluoromethyl-[1,3,4]oxadiazol-2-yl)-5-isopropyl-pyrrolo[2,1-f][1,2,4]triazin-4-ylamino]-2,4-difluoro-N-methoxy-benzamide | CHEMBL194498
TypeSmall organic molecule
Emp. Form.C20H17F4N7O3
Mol. Mass.479.3877
SMILESCONC(=O)c1cc(Nc2ncnn3cc(-c4nnc(o4)C(F)F)c(C(C)C)c23)c(F)cc1F