Reaction Details
TargetEpidermal growth factor receptor
LigandBDBM50168389
Substrate/Competitorn/a
Meas. Tech.ChEMBL_305482 (CHEMBL830273)
IC50 4200±n/a nM
Citation Borzilleri, RMZheng, XQian, LEllis, CCai, ZWWautlet, BSMortillo, SJeyaseelan, RKukral, DWFura, AKamath, AVyas, VTokarski, JSBarrish, JCHunt, JTLombardo, LJFargnoli, JBhide, RS Design, synthesis, and evaluation of orally active 4-(2,4-difluoro-5-(methoxycarbamoyl)phenylamino)pyrrolo[2,1-f][1,2,4]triazines as dual vascular endothelial growth factor receptor-2 and fibroblast growth factor receptor-1 inhibitors. J Med Chem48:3991-4008 (2005) 
 
Epidermal growth factor receptor
Name:Epidermal growth factor receptor
Type:Receptor Kinase Domain
Mol. Mass.:134279.59
Organism:Homo sapiens (Human)
Description:P00533
Residue:1210
BDBM50168389
NameBDBM50168389
Synonyms:CHEMBL195218 | [4-(2,4-Difluoro-5-methoxycarbamoyl-phenylamino)-5-isopropyl-pyrrolo[2,1-f][1,2,4]triazin-6-yl]-carbamic acid 3-methanesulfonyl-propyl ester
TypeSmall organic molecule
Emp. Form.C22H26F2N6O6S
Mol. Mass.540.54
SMILESCONC(=O)c1cc(Nc2ncnn3cc(NC(=O)OCCCS(C)(=O)=O)c(C(C)C)c23)c(F)cc1F