Reaction Details
TargetCyclin-dependent kinase 2
LigandBDBM50168402
Substrate/Competitorn/a
Meas. Tech.ChEMBL_304767 (CHEMBL828533)
IC50>50000±n/a nM
Citation Borzilleri, RMZheng, XQian, LEllis, CCai, ZWWautlet, BSMortillo, SJeyaseelan, RKukral, DWFura, AKamath, AVyas, VTokarski, JSBarrish, JCHunt, JTLombardo, LJFargnoli, JBhide, RS Design, synthesis, and evaluation of orally active 4-(2,4-difluoro-5-(methoxycarbamoyl)phenylamino)pyrrolo[2,1-f][1,2,4]triazines as dual vascular endothelial growth factor receptor-2 and fibroblast growth factor receptor-1 inhibitors. J Med Chem48:3991-4008 (2005) 
 
Cyclin-dependent kinase 2
Name:Cyclin-dependent kinase 2
Type:Enzyme Subunit
Mol. Mass.:33938.17
Organism:Homo sapiens (Human)
Description:P24941
Residue:298
BDBM50168402
NameBDBM50168402
Synonyms:5-{6-[5-(Difluoro-methanesulfonyl-methyl)-[1,3,4]oxadiazol-2-yl]-5-isopropyl-pyrrolo[2,1-f][1,2,4]triazin-4-ylamino}-2,4-difluoro-N-methoxy-benzamide | CHEMBL195903
TypeSmall organic molecule
Emp. Form.C21H19F4N7O5S
Mol. Mass.557.478
SMILESCONC(=O)c1cc(Nc2ncnn3cc(-c4nnc(o4)C(F)(F)S(C)(=O)=O)c(C(C)C)c23)c(F)cc1F