Reaction Details
TargetVascular endothelial growth factor receptor 2
LigandBDBM50168419
Substrate/Competitorn/a
Meas. Tech.ChEMBL_305591 (CHEMBL828038)
IC50 270±n/a nM
Citation Borzilleri, RMZheng, XQian, LEllis, CCai, ZWWautlet, BSMortillo, SJeyaseelan, RKukral, DWFura, AKamath, AVyas, VTokarski, JSBarrish, JCHunt, JTLombardo, LJFargnoli, JBhide, RS Design, synthesis, and evaluation of orally active 4-(2,4-difluoro-5-(methoxycarbamoyl)phenylamino)pyrrolo[2,1-f][1,2,4]triazines as dual vascular endothelial growth factor receptor-2 and fibroblast growth factor receptor-1 inhibitors. J Med Chem48:3991-4008 (2005) 
 
Vascular endothelial growth factor receptor 2
Name:Vascular endothelial growth factor receptor 2
Type:Receptor Tyrosine Kinase
Mol. Mass.:151510.97
Organism:Homo sapiens (Human)
Description:P35968
Residue:1356
BDBM50168419
NameBDBM50168419
Synonyms:4-(4-Bromo-3-methoxycarbamoyl-phenylamino)-5-isopropyl-pyrrolo[2,1-f][1,2,4]triazine-6-carboxylic acid ethyl ester ethyl 4-(4-bromo-3-(methoxycarbamoyl)phenylamino)-5-isopropylpyrrolo[1,2-f][1,2,4]triazine-6-carboxylate
TypeSmall organic molecule
Emp. Form.C20H22BrN5O4
Mol. Mass.476.324
SMILESCCOC(=O)c1cn2ncnc(Nc3ccc(Br)c(c3)C(=O)NOC)c2c1C(C)C