Reaction Details
TargetVascular endothelial growth factor receptor 2
LigandBDBM50168420
Substrate/Competitorn/a
Meas. Tech.ChEMBL_305591 (CHEMBL828038)
IC50 36±n/a nM
Citation Borzilleri, RMZheng, XQian, LEllis, CCai, ZWWautlet, BSMortillo, SJeyaseelan, RKukral, DWFura, AKamath, AVyas, VTokarski, JSBarrish, JCHunt, JTLombardo, LJFargnoli, JBhide, RS Design, synthesis, and evaluation of orally active 4-(2,4-difluoro-5-(methoxycarbamoyl)phenylamino)pyrrolo[2,1-f][1,2,4]triazines as dual vascular endothelial growth factor receptor-2 and fibroblast growth factor receptor-1 inhibitors. J Med Chem48:3991-4008 (2005) 
 
Vascular endothelial growth factor receptor 2
Name:Vascular endothelial growth factor receptor 2
Type:Receptor Tyrosine Kinase
Mol. Mass.:151510.97
Organism:Homo sapiens (Human)
Description:P35968
Residue:1356
BDBM50168420
NameBDBM50168420
Synonyms:CHEMBL191594 | [4-(2,4-Difluoro-5-methoxycarbamoyl-phenylamino)-5-isopropyl-pyrrolo[2,1-f][1,2,4]triazin-6-yl]-carbamic acid 1-methyl-piperidin-4-yl ester
TypeSmall organic molecule
Emp. Form.C24H29F2N7O4
Mol. Mass.517.5284
SMILESCONC(=O)c1cc(Nc2ncnn3cc(NC(=O)OC4CCN(C)CC4)c(C(C)C)c23)c(F)cc1F