Reaction Details
TargetRibosomal protein S6 kinase alpha-5
LigandBDBM50168582
Substrate/Competitorn/a
Meas. Tech.ChEMBL_304581 (CHEMBL828472)
IC50 126±n/a nM
Citation Bamford, MJAlberti, MJBailey, NDavies, SDean, DKGaiba, AGarland, SHarling, JDJung, DKPanchal, TAParr, CASteadman, JGTakle, AKTownsend, JTWilson, DMWitherington, J (1H-imidazo[4,5-c]pyridin-2-yl)-1,2,5-oxadiazol-3-ylamine derivatives: a novel class of potent MSK-1-inhibitors. Bioorg Med Chem Lett15:3402-6 (2005) 
 
Ribosomal protein S6 kinase alpha-5
Name:Ribosomal protein S6 kinase alpha-5
Type:Serine/threonine-protein kinase
Mol. Mass.:89874.44
Organism:Homo sapiens (Human)
Description:n/a
Residue:802
BDBM50168582
NameBDBM50168582
Synonyms:4-(1-Methyl-1H-imidazo[4,5-c]pyridin-2-yl)-furazan-3-ylamine | CHEMBL188048
TypeSmall organic molecule
Emp. Form.C9H8N6O
Mol. Mass.216.1994
SMILESCn1c(nc2cnccc12)-c1nonc1N