Reaction Details
TargetRibosomal protein S6 kinase alpha-5
LigandBDBM50168593
Substrate/Competitorn/a
Meas. Tech.ChEMBL_304581 (CHEMBL828472)
IC50 258±n/a nM
Citation Bamford, MJAlberti, MJBailey, NDavies, SDean, DKGaiba, AGarland, SHarling, JDJung, DKPanchal, TAParr, CASteadman, JGTakle, AKTownsend, JTWilson, DMWitherington, J (1H-imidazo[4,5-c]pyridin-2-yl)-1,2,5-oxadiazol-3-ylamine derivatives: a novel class of potent MSK-1-inhibitors. Bioorg Med Chem Lett15:3402-6 (2005) 
 
Ribosomal protein S6 kinase alpha-5
Name:Ribosomal protein S6 kinase alpha-5
Type:Serine/threonine-protein kinase
Mol. Mass.:89874.44
Organism:Homo sapiens (Human)
Description:n/a
Residue:802
BDBM50168593
NameBDBM50168593
Synonyms:2-(4-Amino-furazan-3-yl)-3-ethyl-3H-benzoimidazol-5-ol | CHEMBL365902
TypeSmall organic molecule
Emp. Form.C11H11N5O2
Mol. Mass.245.2373
SMILESCCn1c(nc2ccc(O)cc12)-c1nonc1N