Reaction Details
TargetCyclin-dependent kinase 2
LigandBDBM14032
Substrate/Competitorn/a
Meas. Tech.ChEMBL_304606 (CHEMBL828493)
IC50 169±n/a nM
Citation Bamford, MJBailey, NDavies, SDean, DKFrancis, LPanchal, TAParr, CASehmi, SSteadman, JGTakle, AKTownsend, JTWilson, DM (1H-imidazo[4,5-c]pyridin-2-yl)-1,2,5-oxadiazol-3-ylamine derivatives: further optimisation as highly potent and selective MSK-1-inhibitors. Bioorg Med Chem Lett15:3407-11 (2005) 
 
Cyclin-dependent kinase 2
Name:Cyclin-dependent kinase 2
Type:Enzyme Subunit
Mol. Mass.:33938.17
Organism:Homo sapiens (Human)
Description:P24941
Residue:298
BDBM14032
NameBDBM14032
Synonyms:4-(1-ethyl-1H-imidazo[4,5-c]pyridin-2-yl)-1,2,5-oxadiazol-3-amine Aminofurazanyl-azabenzimidazole 1 | CHEMBL189657
TypeSmall organic molecule
Emp. Form.C10H10N6O
Mol. Mass.230.226
SMILESCCn1c(nc2cnccc12)-c1nonc1N