Reaction Details
TargetGlutamate receptor ionotropic, kainate 2
LigandBDBM50168964
Substrate/Competitorn/a
Meas. Tech.ChEMBL_303287 (CHEMBL828280)
Ki>100000±n/a nM
Citation Dominguez, EIyengar, SShannon, HEBleakman, DAlt, AArnold, BMBell, MGBleisch, TJBuckmaster, JLCastano, AMDel Prado, MEscribano, AFilla, SAHo, KHHudziak, KJJones, CKMartinez-Perez, JAMateo, AMathes, BMMattiuz, ELOgden, AMSimmons, RMStack, DRStratford, REWinter, MAWu, ZOrnstein, PL Two prodrugs of potent and selective GluR5 kainate receptor antagonists actives in three animal models of pain. J Med Chem48:4200-3 (2005) 
 
Glutamate receptor ionotropic, kainate 2
Name:Glutamate receptor ionotropic, kainate 2
Type:Enzyme Catalytic Domain
Mol. Mass.:102592.78
Organism:Homo sapiens (Human)
Description:Q13002
Residue:908
BDBM50168964
NameBDBM50168964
Synonyms:(3S,4aR,6S,8aR)-6-[2-(1H-Tetrazol-5-yl)-phenylamino]-decahydro-isoquinoline-3-carboxylic acid | CHEMBL191249
TypeSmall organic molecule
Emp. Form.C17H22N6O2
Mol. Mass.342.3956
SMILESOC(=O)[C@@H]1C[C@H]2C[C@H](CC[C@H]2CN1)Nc1ccccc1-c1nnn[nH]1