Reaction Details
TargetMetabotropic glutamate receptor 4
LigandBDBM50293743
Substrate/Competitorn/a
Meas. Tech.ChEMBL_2215503 (CHEMBL5128635)
EC50 1100±n/a nM
Citation Zhong, ZHe, XGe, JZhu, JYao, CCai, HYe, XYXie, TBai, R Discovery of small-molecule compounds and natural products against Parkinson's disease: Pathological mechanism and structural modification. Eur J Med Chem237:0 (2022) 
 
Metabotropic glutamate receptor 4
Name:Metabotropic glutamate receptor 4
Type:Protein
Mol. Mass.:101899.95
Organism:Homo sapiens (Human)
Description:Q14833
Residue:912
BDBM50293743
NameBDBM50293743
Synonyms:CHEMBL556667 cid_836002
TypeSmall organic molecule
Emp. Form.C12H9ClN2O
Mol. Mass.232.666
SMILESClc1cccc(NC(=O)c2ccccn2)c1