Reaction Details
TargetRNA-directed RNA polymerase
LigandBDBM50169916
Substrate/Competitorn/a
Meas. Tech.ChEMBL_305448 (CHEMBL830123)
IC50 18±n/a nM
Citation Harper, SAvolio, SPacini, BDi Filippo, MAltamura, STomei, LPaonessa, GDi Marco, SCarfi, AGiuliano, CPadron, JBonelli, FMigliaccio, GDe Francesco, RLaufer, RRowley, MNarjes, F Potent inhibitors of subgenomic hepatitis C virus RNA replication through optimization of indole-N-acetamide allosteric inhibitors of the viral NS5B polymerase. J Med Chem48:4547-57 (2005) 
 
RNA-directed RNA polymerase
Name:RNA-directed RNA polymerase
Type:Protein
Mol. Mass.:25173.95
Organism:Hepatitis C virus
Description:Q8JXU8
Residue:229
BDBM50169916
NameBDBM50169916
Synonyms:3-Cyclohexyl-1-{[methyl-(1-methyl-piperidin-3-ylmethyl)-carbamoyl]-methyl}-2-phenyl-1H-indole-6-carboxylic acid | CHEMBL189054
TypeSmall organic molecule
Emp. Form.C31H39N3O3
Mol. Mass.501.6597
SMILESCN(CC1CCCN(C)C1)C(=O)Cn1c(c(C2CCCCC2)c2ccc(cc12)C(O)=O)-c1ccccc1