Reaction Details
TargetRNA-directed RNA polymerase
LigandBDBM50169930
Substrate/Competitorn/a
Meas. Tech.ChEMBL_305448 (CHEMBL830123)
IC50 8±n/a nM
Citation Harper, SAvolio, SPacini, BDi Filippo, MAltamura, STomei, LPaonessa, GDi Marco, SCarfi, AGiuliano, CPadron, JBonelli, FMigliaccio, GDe Francesco, RLaufer, RRowley, MNarjes, F Potent inhibitors of subgenomic hepatitis C virus RNA replication through optimization of indole-N-acetamide allosteric inhibitors of the viral NS5B polymerase. J Med Chem48:4547-57 (2005) 
 
RNA-directed RNA polymerase
Name:RNA-directed RNA polymerase
Type:Protein
Mol. Mass.:25173.95
Organism:Hepatitis C virus
Description:Q8JXU8
Residue:229
BDBM50169930
NameBDBM50169930
Synonyms:2-(4-Chloro-phenyl)-3-cyclohexyl-1-[(cyclopropylmethyl-carbamoyl)-methyl]-1H-indole-6-carboxylic acid | CHEMBL363199
TypeSmall organic molecule
Emp. Form.C27H29ClN2O3
Mol. Mass.464.984
SMILESOC(=O)c1ccc2c(C3CCCCC3)c(-c3ccc(Cl)cc3)n(CC(=O)NCC3CC3)c2c1