Reaction Details
TargetRNA-directed RNA polymerase
LigandBDBM50169913
Substrate/Competitorn/a
Meas. Tech.ChEMBL_305448 (CHEMBL830123)
IC50 78±n/a nM
Citation Harper, SAvolio, SPacini, BDi Filippo, MAltamura, STomei, LPaonessa, GDi Marco, SCarfi, AGiuliano, CPadron, JBonelli, FMigliaccio, GDe Francesco, RLaufer, RRowley, MNarjes, F Potent inhibitors of subgenomic hepatitis C virus RNA replication through optimization of indole-N-acetamide allosteric inhibitors of the viral NS5B polymerase. J Med Chem48:4547-57 (2005) 
 
RNA-directed RNA polymerase
Name:RNA-directed RNA polymerase
Type:Protein
Mol. Mass.:25173.95
Organism:Hepatitis C virus
Description:Q8JXU8
Residue:229
BDBM50169913
NameBDBM50169913
Synonyms:3-Cyclohexyl-1-dimethylcarbamoylmethyl-2-{3-[(isopropyl-methyl-amino)-methyl]-phenyl}-1H-indole-6-carboxylic acid | CHEMBL363342
TypeSmall organic molecule
Emp. Form.C30H39N3O3
Mol. Mass.489.649
SMILESCC(C)N(C)Cc1cccc(c1)-c1c(C2CCCCC2)c2ccc(cc2n1CC(=O)N(C)C)C(O)=O