Reaction Details
TargetRNA-directed RNA polymerase
LigandBDBM50169924
Substrate/Competitorn/a
Meas. Tech.ChEMBL_305448 (CHEMBL830123)
IC50 63±n/a nM
Citation Harper, SAvolio, SPacini, BDi Filippo, MAltamura, STomei, LPaonessa, GDi Marco, SCarfi, AGiuliano, CPadron, JBonelli, FMigliaccio, GDe Francesco, RLaufer, RRowley, MNarjes, F Potent inhibitors of subgenomic hepatitis C virus RNA replication through optimization of indole-N-acetamide allosteric inhibitors of the viral NS5B polymerase. J Med Chem48:4547-57 (2005) 
 
RNA-directed RNA polymerase
Name:RNA-directed RNA polymerase
Type:Protein
Mol. Mass.:25173.95
Organism:Hepatitis C virus
Description:Q8JXU8
Residue:229
BDBM50169924
NameBDBM50169924
Synonyms:3-Cyclohexyl-1-[(cyclopropylmethyl-carbamoyl)-methyl]-2-phenyl-1H-indole-6-carboxylic acid | CHEMBL364269
TypeSmall organic molecule
Emp. Form.C27H30N2O3
Mol. Mass.430.5387
SMILESOC(=O)c1ccc2c(C3CCCCC3)c(-c3ccccc3)n(CC(=O)NCC3CC3)c2c1