Reaction Details
TargetRNA-directed RNA polymerase
LigandBDBM50169942
Substrate/Competitorn/a
Meas. Tech.ChEMBL_305448 (CHEMBL830123)
IC50 7±n/a nM
Citation Harper, SAvolio, SPacini, BDi Filippo, MAltamura, STomei, LPaonessa, GDi Marco, SCarfi, AGiuliano, CPadron, JBonelli, FMigliaccio, GDe Francesco, RLaufer, RRowley, MNarjes, F Potent inhibitors of subgenomic hepatitis C virus RNA replication through optimization of indole-N-acetamide allosteric inhibitors of the viral NS5B polymerase. J Med Chem48:4547-57 (2005) 
 
RNA-directed RNA polymerase
Name:RNA-directed RNA polymerase
Type:Protein
Mol. Mass.:25173.95
Organism:Hepatitis C virus
Description:Q8JXU8
Residue:229
BDBM50169942
NameBDBM50169942
Synonyms:2-(4-Chloro-phenyl)-3-cyclohexyl-1-[2-(4-methanesulfonyl-piperazin-1-yl)-2-oxo-ethyl]-1H-indole-6-carboxylic acid | CHEMBL191196
TypeSmall organic molecule
Emp. Form.C28H32ClN3O5S
Mol. Mass.558.089
SMILESCS(=O)(=O)N1CCN(CC1)C(=O)Cn1c(c(C2CCCCC2)c2ccc(cc12)C(O)=O)-c1ccc(Cl)cc1