Reaction Details
TargetMatrix metalloproteinase-14
LigandBDBM50170297
Substrate/Competitorn/a
Meas. Tech.ChEMBL_304646 (CHEMBL828529)
IC50 5600±n/a nM
Citation Wu, JRush, TSHotchandani, RDu, XGeck, MCollins, EXu, ZBSkotnicki, JLevin, JILovering, FE Identification of potent and selective MMP-13 inhibitors. Bioorg Med Chem Lett15:4105-9 (2005) 
 
Matrix metalloproteinase-14
Name:Matrix metalloproteinase-14
Type:Protein
Mol. Mass.:65900.19
Organism:Homo sapiens (Human)
Description:P50281
Residue:582
BDBM50170297
NameBDBM50170297
Synonyms:(S)-2-{4'-[(1H-Indole-2-carbonyl)-amino]-biphenyl-4-sulfonylamino}-3-methyl-butyric acid | CHEMBL189666
TypeSmall organic molecule
Emp. Form.C26H25N3O5S
Mol. Mass.491.559
SMILESCC(C)[C@H](NS(=O)(=O)c1ccc(cc1)-c1ccc(NC(=O)c2cc3ccccc3[nH]2)cc1)C(O)=O