Reaction Details
Target72 kDa type IV collagenase
LigandBDBM50170287
Substrate/Competitorn/a
Meas. Tech.ChEMBL_304620 (CHEMBL828506)
IC50 1.9±n/a nM
Citation Wu, JRush, TSHotchandani, RDu, XGeck, MCollins, EXu, ZBSkotnicki, JLevin, JILovering, FE Identification of potent and selective MMP-13 inhibitors. Bioorg Med Chem Lett15:4105-9 (2005) 
 
72 kDa type IV collagenase
Name:72 kDa type IV collagenase
Type:Enzyme
Mol. Mass.:73870.36
Organism:Homo sapiens (Human)
Description: P08253
Residue:660
BDBM50170287
NameBDBM50170287
Synonyms:(S)-2-{4'-[(5-Methoxy-benzofuran-2-carbonyl)-amino]-biphenyl-4-sulfonylamino}-3-methyl-butyric acid | CHEMBL263750
TypeSmall organic molecule
Emp. Form.C27H26N2O7S
Mol. Mass.522.57
SMILESCOc1ccc2oc(cc2c1)C(=O)Nc1ccc(cc1)-c1ccc(cc1)S(=O)(=O)N[C@@H](C(C)C)C(O)=O