Reaction Details
TargetCollagenase 3
LigandBDBM50170286
Substrate/Competitorn/a
Meas. Tech.ChEMBL_305658 (CHEMBL829516)
IC50 4.5±n/a nM
Citation Wu, JRush, TSHotchandani, RDu, XGeck, MCollins, EXu, ZBSkotnicki, JLevin, JILovering, FE Identification of potent and selective MMP-13 inhibitors. Bioorg Med Chem Lett15:4105-9 (2005) 
 
Collagenase 3
Name:Collagenase 3
Type:PROTEIN
Mol. Mass.:53910.47
Organism:Bos taurus
Description:ChEMBL_305658
Residue:471
BDBM50170286
NameBDBM50170286
Synonyms:(S)-2-{4'-[(Benzofuran-2-carbonyl)-amino]-biphenyl-4-sulfonylamino}-3-hydroxy-propionic acid | CHEMBL189250
TypeSmall organic molecule
Emp. Form.C24H20N2O7S
Mol. Mass.480.49
SMILESOC[C@H](NS(=O)(=O)c1ccc(cc1)-c1ccc(NC(=O)c2cc3ccccc3o2)cc1)C(O)=O