Reaction Details
TargetCollagenase 3
LigandBDBM50170288
Substrate/Competitorn/a
Meas. Tech.ChEMBL_305658 (CHEMBL829516)
IC50 3.4±n/a nM
Citation Wu, JRush, TSHotchandani, RDu, XGeck, MCollins, EXu, ZBSkotnicki, JLevin, JILovering, FE Identification of potent and selective MMP-13 inhibitors. Bioorg Med Chem Lett15:4105-9 (2005) 
 
Collagenase 3
Name:Collagenase 3
Type:PROTEIN
Mol. Mass.:53910.47
Organism:Bos taurus
Description:ChEMBL_305658
Residue:471
BDBM50170288
NameBDBM50170288
Synonyms:(S)-2-{4'-[(5-Benzenesulfonylamino-benzofuran-2-carbonyl)-amino]-biphenyl-4-sulfonylamino}-3-methyl-butyric acid | CHEMBL189700
TypeSmall organic molecule
Emp. Form.C32H29N3O8S2
Mol. Mass.647.718
SMILESCC(C)[C@H](NS(=O)(=O)c1ccc(cc1)-c1ccc(NC(=O)c2cc3cc(NS(=O)(=O)c4ccccc4)ccc3o2)cc1)C(O)=O