Reaction Details
TargetCollagenase 3
LigandBDBM28485
Substrate/Competitorn/a
Meas. Tech.ChEMBL_305658 (CHEMBL829516)
IC50 1.3±n/a nM
Citation Wu, JRush, TSHotchandani, RDu, XGeck, MCollins, EXu, ZBSkotnicki, JLevin, JILovering, FE Identification of potent and selective MMP-13 inhibitors. Bioorg Med Chem Lett15:4105-9 (2005) 
 
Collagenase 3
Name:Collagenase 3
Type:PROTEIN
Mol. Mass.:53910.47
Organism:Bos taurus
Description:ChEMBL_305658
Residue:471
BDBM28485
NameBDBM28485
Synonyms:(2S)-2-({4-[4-(1-benzofuran-2-amido)phenyl]benzene}sulfonamido)-3-methylbutanoic acid benzofuran, 1
TypeSmall organic molecule
Emp. Form.C26H24N2O6S
Mol. Mass.492.544
SMILESCC(C)[C@H](NS(=O)(=O)c1ccc(cc1)-c1ccc(NC(=O)c2cc3ccccc3o2)cc1)C(O)=O