Reaction Details
Target72 kDa type IV collagenase
LigandBDBM50170301
Substrate/Competitorn/a
Meas. Tech.ChEMBL_304620 (CHEMBL828506)
IC50 23±n/a nM
Citation Wu, JRush, TSHotchandani, RDu, XGeck, MCollins, EXu, ZBSkotnicki, JLevin, JILovering, FE Identification of potent and selective MMP-13 inhibitors. Bioorg Med Chem Lett15:4105-9 (2005) 
 
72 kDa type IV collagenase
Name:72 kDa type IV collagenase
Type:Enzyme
Mol. Mass.:73870.36
Organism:Homo sapiens (Human)
Description: P08253
Residue:660
BDBM50170301
NameBDBM50170301
Synonyms:(S)-2-{4'-[(Benzofuran-2-ylmethyl)-amino]-biphenyl-4-sulfonylamino}-3-methyl-butyric acid | CHEMBL408720
TypeSmall organic molecule
Emp. Form.C26H26N2O5S
Mol. Mass.478.56
SMILESCC(C)[C@H](NS(=O)(=O)c1ccc(cc1)-c1ccc(NCc2cc3ccccc3o2)cc1)C(O)=O