Reaction Details
TargetProgesterone receptor
LigandBDBM50118696
Substrate/Competitorn/a
Meas. Tech.ChEMBL_305124 (CHEMBL876979)
IC50 15±n/a nM
Citation Fensome, ABender, RChopra, RCohen, JCollins, MAHudak, VMalakian, KLockhead, SOlland, ASvenson, KTerefenko, EAUnwalla, RJWilhelm, JMWolfrom, SZhu, YZhang, ZZhang, PWinneker, RCWrobel, J Synthesis and structure-activity relationship of novel 6-aryl-1,4-dihydrobenzo[d][1,3]oxazine-2-thiones as progesterone receptor modulators leading to the potent and selective nonsteroidal progesterone receptor agonist tanaproget. J Med Chem48:5092-5 (2005) 
 
Progesterone receptor
Name:Progesterone receptor
Type:Protein
Mol. Mass.:98979.52
Organism:Homo sapiens (Human)
Description:P06401
Residue:933
BDBM50118696
NameBDBM50118696
Synonyms:5-(4,4-Dimethyl-2-oxo-1,4-dihydro-2H-benzo[d][1,3]oxazin-6-yl)-2-fluoro-benzonitrile CHEMBL136721
TypeSmall organic molecule
Emp. Form.C17H13FN2O2
Mol. Mass.296.2957
SMILESCC1(C)OC(=O)Nc2ccc(cc12)-c1ccc(F)c(c1)C#N