Reaction Details
TargetCarboxypeptidase G2
LigandBDBM50171504
Substrate/Competitorn/a
Meas. Tech.ChEMBL_302801 (CHEMBL876359)
Ki 127000±n/a nM
Citation Davies, LCFriedlos, FHedley, DMartin, JOgilvie, LMScanlon, IJSpringer, CJ Novel fluorinated prodrugs for activation by carboxypeptidase G2 showing good in vivo antitumor activity in gene-directed enzyme prodrug therapy. J Med Chem48:5321-8 (2005) 
 
Carboxypeptidase G2
Name:Carboxypeptidase G2
Synonyms:n/a
Type:PROTEIN
Mol. Mass.:44005.37
Organism:Pseudomonas aeruginosa
Description:ChEMBL_302801
Residue:412
BDBM50171504
NameBDBM50171504
TypeSmall organic molecule
Emp. Form.C16H16Cl2F4N2O5
Mol. Mass.463.208
SMILESOC(=O)CC[C@H](NC(=O)c1c(F)c(F)c(N(CCCl)CCCl)c(F)c1F)C(O)=O