Reaction Details
TargetDipeptidyl peptidase 2
LigandBDBM50171558
Substrate/Competitorn/a
Meas. Tech.ChEMBL_321387 (CHEMBL881765)
IC50 3.7±n/a nM
Citation Shreder, KRWong, MSCorral, SYu, ZWinn, DTWu, MHu, YNomanbhoy, TAlemayehu, SFuller, SRRosenblum, JSKozarich, JW Boro-norleucine as a P1 residue for the design of selective and potent DPP7 inhibitors. Bioorg Med Chem Lett15:4256-60 (2005) 
 
Dipeptidyl peptidase 2
Name:Dipeptidyl peptidase 2
Type:Protein
Mol. Mass.:54339.29
Organism:Homo sapiens (Human)
Description:Q9UHL4
Residue:492
BDBM50171558
NameBDBM50171558
Synonyms:2,6-Diamino-hexanoic acid ((R)-1-boron-dihydroxide-pentyl)-amide | CHEMBL194517
TypeSmall organic molecule
Emp. Form.C11H26BN3O3
Mol. Mass.259.153
SMILESCCCC[C@@H](NC(=O)[C@@H](N)CCCCN)B(O)O