Reaction Details
TargetReverse transcriptase/RNaseH
LigandBDBM50171974
Substrate/Competitorn/a
Meas. Tech.ChEMBL_317566 (CHEMBL825231)
EC50 15±n/a nM
Citation O'Meara, JAYoakim, CBonneau, PRBös, MCordingley, MGDéziel, RDoyon, LDuan, JGarneau, MGuse, ILandry, SMalenfant, ENaud, JOgilvie, WWThavonekham, BSimoneau, B Novel 8-substituted dipyridodiazepinone inhibitors with a broad-spectrum of activity against HIV-1 strains resistant to non-nucleoside reverse transcriptase inhibitors. J Med Chem48:5580-8 (2005) 
 
Reverse transcriptase/RNaseH
Name:Reverse transcriptase/RNaseH
Type:PROTEIN
Mol. Mass.:65229.15
Organism:Human immunodeficiency virus 1
Description:ChEMBL_1473730
Residue:566
BDBM50171974
NameBDBM50171974
Synonyms:4-[2-(5-Ethyl-7-methoxy-10-methyl-11-oxo-10,11-dihydro-5H-4,5,6,10-tetraaza-dibenzo[a,d]cyclohepten-2-yl)-ethoxy]-3-methyl-benzoic acid | CHEMBL191163
TypeSmall organic molecule
Emp. Form.C25H26N4O5
Mol. Mass.462.4977
SMILESCCN1c2nc(OC)ccc2N(C)C(=O)c2cc(CCOc3ccc(cc3C)C(O)=O)cnc12