Reaction Details
TargetCytochrome P450 2D6
LigandBDBM50171976
Substrate/Competitorn/a
Meas. Tech.ChEMBL_306100 (CHEMBL830875)
IC50>30000±n/a nM
Citation O'Meara, JAYoakim, CBonneau, PRBös, MCordingley, MGDéziel, RDoyon, LDuan, JGarneau, MGuse, ILandry, SMalenfant, ENaud, JOgilvie, WWThavonekham, BSimoneau, B Novel 8-substituted dipyridodiazepinone inhibitors with a broad-spectrum of activity against HIV-1 strains resistant to non-nucleoside reverse transcriptase inhibitors. J Med Chem48:5580-8 (2005) 
 
Cytochrome P450 2D6
Name:Cytochrome P450 2D6
Type:Protein
Mol. Mass.:55774.82
Organism:Homo sapiens (Human)
Description:P10635
Residue:497
BDBM50171976
NameBDBM50171976
Synonyms:4-[2-(5-Ethyl-7-fluoro-10-methyl-11-oxo-10,11-dihydro-5H-4,5,6,10-tetraaza-dibenzo[a,d]cyclohepten-2-yl)-ethoxy]-3-methyl-benzoic acid | CHEMBL189942
TypeSmall organic molecule
Emp. Form.C24H23FN4O4
Mol. Mass.450.4622
SMILESCCN1c2ncc(CCOc3ccc(cc3C)C(O)=O)cc2C(=O)N(C)c2ccc(F)nc12