Reaction Details
TargetMelanin-concentrating hormone receptor 1
LigandBDBM50173462
Substrate/Competitorn/a
Meas. Tech.ChEMBL_322396 (CHEMBL871872)
IC50 41±n/a nM
Citation Kym, PRIyengar, RSouers, AJLynch, JKJudd, ASGao, JFreeman, JMulhern, MZhao, GVasudevan, AWodka, DBlackburn, CBrown, JChe, JLCullis, CLai, SJLaMarche, MJMarsilje, TRoses, JSells, TGeddes, BGovek, EPatane, MFry, DDayton, BDBrodjian, SFalls, DBrune, MBush, EShapiro, RKnourek-Segel, VFey, TMcDowell, CReinhart, GAPreusser, LCMarsh, KHernandez, LSham, HLCollins, CA Discovery and characterization of aminopiperidinecoumarin melanin concentrating hormone receptor 1 antagonists. J Med Chem48:5888-91 (2005) 
 
Melanin-concentrating hormone receptor 1
Name:Melanin-concentrating hormone receptor 1
Type:G Protein-Coupled Receptor (GPCR)
Mol. Mass.:45976.27
Organism:Homo sapiens (Human)
Description:Membranes from CHO-K1 cells stably expressing human MCH1R were used in assays.
Residue:422
BDBM50173462
NameBDBM50173462
Synonyms:6-Chloro-4-[1-(2,3-dihydro-benzofuran-5-ylmethyl)-piperidin-4-ylamino]-chromen-2-one | CHEMBL372919
TypeSmall organic molecule
Emp. Form.C23H23ClN2O3
Mol. Mass.410.893
SMILESClc1ccc2oc(=O)cc(NC3CCN(Cc4ccc5OCCc5c4)CC3)c2c1