Reaction Details
TargetMelanin-concentrating hormone receptor 1
LigandBDBM50173452
Substrate/Competitorn/a
Meas. Tech.ChEMBL_321503 (CHEMBL880563)
IC50 6±n/a nM
Citation Kym, PRIyengar, RSouers, AJLynch, JKJudd, ASGao, JFreeman, JMulhern, MZhao, GVasudevan, AWodka, DBlackburn, CBrown, JChe, JLCullis, CLai, SJLaMarche, MJMarsilje, TRoses, JSells, TGeddes, BGovek, EPatane, MFry, DDayton, BDBrodjian, SFalls, DBrune, MBush, EShapiro, RKnourek-Segel, VFey, TMcDowell, CReinhart, GAPreusser, LCMarsh, KHernandez, LSham, HLCollins, CA Discovery and characterization of aminopiperidinecoumarin melanin concentrating hormone receptor 1 antagonists. J Med Chem48:5888-91 (2005) 
 
Melanin-concentrating hormone receptor 1
Name:Melanin-concentrating hormone receptor 1
Type:G Protein-Coupled Receptor (GPCR)
Mol. Mass.:45976.27
Organism:Homo sapiens (Human)
Description:Membranes from CHO-K1 cells stably expressing human MCH1R were used in assays.
Residue:422
BDBM50173452
NameBDBM50173452
Synonyms:4-(1-Benzo[b]thiophen-5-ylmethyl-piperidin-4-ylamino)-6-chloro-chromen-2-one | CHEMBL363139
TypeSmall organic molecule
Emp. Form.C23H21ClN2O2S
Mol. Mass.424.943
SMILESClc1ccc2oc(=O)cc(NC3CCN(Cc4ccc5sccc5c4)CC3)c2c1