Reaction Details
TargetReverse transcriptase/RNaseH
LigandBDBM50173809
Substrate/Competitorn/a
Meas. Tech.ChEMBL_321537 (CHEMBL880597)
IC50 97800±n/a nM
Citation Deng, BLHartman, TLBuckheit, RWPannecouque, CDe Clercq, EFanwick, PECushman, M Synthesis, anti-HIV activity, and metabolic stability of new alkenyldiarylmethane HIV-1 non-nucleoside reverse transcriptase inhibitors. J Med Chem48:6140-55 (2005) 
 
Reverse transcriptase/RNaseH
Name:Reverse transcriptase/RNaseH
Type:PROTEIN
Mol. Mass.:65229.15
Organism:Human immunodeficiency virus 1
Description:ChEMBL_1473730
Residue:566
BDBM50173809
NameBDBM50173809
Synonyms:3-[(E)-4-(3,4-Dimethoxy-phenyl)-4-(3-fluoro-5-trifluoromethyl-phenyl)-but-3-enyl]-oxazolidin-2-one | CHEMBL196121
TypeSmall organic molecule
Emp. Form.C22H21F4NO4
Mol. Mass.439.4001
SMILESCOc1ccc(cc1OC)C(=C/CCN1CCOC1=O)\c1cc(F)cc(c1)C(F)(F)F