Reaction Details
TargetReverse transcriptase/RNaseH
LigandBDBM50173817
Substrate/Competitorn/a
Meas. Tech.ChEMBL_321537 (CHEMBL880597)
IC50>100000±n/a nM
Citation Deng, BLHartman, TLBuckheit, RWPannecouque, CDe Clercq, EFanwick, PECushman, M Synthesis, anti-HIV activity, and metabolic stability of new alkenyldiarylmethane HIV-1 non-nucleoside reverse transcriptase inhibitors. J Med Chem48:6140-55 (2005) 
 
Reverse transcriptase/RNaseH
Name:Reverse transcriptase/RNaseH
Type:PROTEIN
Mol. Mass.:65229.15
Organism:Human immunodeficiency virus 1
Description:ChEMBL_1473730
Residue:566
BDBM50173817
NameBDBM50173817
Synonyms:3-Chloro-5-[(E)-1-(3-fluoro-5-trifluoromethyl-phenyl)-5-methoxycarbonyl-pent-1-enyl]-2-methoxy-benzoic acid methyl ester | CHEMBL196011
TypeSmall organic molecule
Emp. Form.C23H21ClF4O5
Mol. Mass.488.856
SMILESCOC(=O)CCC\C=C(/c1cc(F)cc(c1)C(F)(F)F)c1cc(Cl)c(OC)c(c1)C(=O)OC