Reaction Details
TargetReverse transcriptase/RNaseH
LigandBDBM50173811
Substrate/Competitorn/a
Meas. Tech.ChEMBL_321537 (CHEMBL880597)
IC50 8200±n/a nM
Citation Deng, BLHartman, TLBuckheit, RWPannecouque, CDe Clercq, EFanwick, PECushman, M Synthesis, anti-HIV activity, and metabolic stability of new alkenyldiarylmethane HIV-1 non-nucleoside reverse transcriptase inhibitors. J Med Chem48:6140-55 (2005) 
 
Reverse transcriptase/RNaseH
Name:Reverse transcriptase/RNaseH
Type:PROTEIN
Mol. Mass.:65229.15
Organism:Human immunodeficiency virus 1
Description:ChEMBL_1473730
Residue:566
BDBM50173811
NameBDBM50173811
Synonyms:(Z)-6-(5-Chloro-2-methoxy-phenyl)-6-(2,7-dimethyl-3-oxo-2,3-dihydro-benzo[d]isoxazol-5-yl)-hex-5-enoic acid methyl ester | CHEMBL196274
TypeSmall organic molecule
Emp. Form.C23H24ClNO5
Mol. Mass.429.893
SMILESCOC(=O)CCC\C=C(\c1cc(C)c2on(C)c(=O)c2c1)c1cc(Cl)ccc1OC