Reaction Details
TargetReverse transcriptase/RNaseH
LigandBDBM50410542
Substrate/Competitorn/a
Meas. Tech.ChEMBL_321537 (CHEMBL880597)
IC50>100000±n/a nM
Citation Deng, BLHartman, TLBuckheit, RWPannecouque, CDe Clercq, EFanwick, PECushman, M Synthesis, anti-HIV activity, and metabolic stability of new alkenyldiarylmethane HIV-1 non-nucleoside reverse transcriptase inhibitors. J Med Chem48:6140-55 (2005) 
 
Reverse transcriptase/RNaseH
Name:Reverse transcriptase/RNaseH
Type:PROTEIN
Mol. Mass.:65229.15
Organism:Human immunodeficiency virus 1
Description:ChEMBL_1473730
Residue:566
BDBM50410542
NameBDBM50410542
Synonyms:CHEMBL2096827
TypeSmall organic molecule
Emp. Form.C25H29NO7
Mol. Mass.455.5003
SMILESCOC(=O)c1cc(cc(C)c1OC)C(=C\CCN1CCOC1=O)\c1ccc(OC)c(OC)c1