Reaction Details
TargetCoagulation factor X
LigandBDBM26351
Substrate/Competitorn/a
Meas. Tech.ChEMBL_326962 (CHEMBL853297)
IC50 30±n/a nM
Citation Shi, YZhang, JStein, PDShi, MO'Connor, SPBisaha, SNLi, CAtwal, KSBisacchi, GSSitkoff, DPudzianowski, ATLiu, ECHartl, KSSeiler, SMYoussef, SSteinbacher, TESchumacher, WARendina, ARBozarth, JMPeterson, TLZhang, GZahler, R Ketene aminal-based lactam derivatives as a novel class of orally active FXa inhibitors. Bioorg Med Chem Lett15:5453-8 (2005) 
 
Coagulation factor X
Name:Coagulation factor X
Type:Enzyme
Mol. Mass.:54726.60
Organism:Homo sapiens (Human)
Description:n/a
Residue:488
BDBM26351
NameBDBM26351
Synonyms:2-methylbenzofuran compound, 2 CHEMBL196803
TypeSmall organic molecule
Emp. Form.C25H28N6O3
Mol. Mass.460.5282
SMILESCc1cc2cc(ccc2o1)N=C(N[C@H]1CCCCN(CC(=O)N2CCCC2)C1=O)C(C#N)C#N