Reaction Details
TargetCoagulation factor X
LigandBDBM50175090
Substrate/Competitorn/a
Meas. Tech.ChEMBL_326962 (CHEMBL853297)
IC50>34000±n/a nM
Citation Shi, YZhang, JStein, PDShi, MO'Connor, SPBisaha, SNLi, CAtwal, KSBisacchi, GSSitkoff, DPudzianowski, ATLiu, ECHartl, KSSeiler, SMYoussef, SSteinbacher, TESchumacher, WARendina, ARBozarth, JMPeterson, TLZhang, GZahler, R Ketene aminal-based lactam derivatives as a novel class of orally active FXa inhibitors. Bioorg Med Chem Lett15:5453-8 (2005) 
 
Coagulation factor X
Name:Coagulation factor X
Type:Enzyme
Mol. Mass.:54726.60
Organism:Homo sapiens (Human)
Description:n/a
Residue:488
BDBM50175090
NameBDBM50175090
Synonyms:(S,Z)-3-(1-(4-(dimethylamino)phenylamino)-2-nitrovinylamino)-1-(2-oxo-2-(pyrrolidin-1-yl)ethyl)azepan-2-one | CHEMBL371933
TypeSmall organic molecule
Emp. Form.C22H32N6O4
Mol. Mass.444.5273
SMILESCN(C)c1ccc(NC(C[N+]([O-])=O)=N[C@H]2CCCCN(CC(=O)N3CCCC3)C2=O)cc1