Reaction Details
TargetCoagulation factor X
LigandBDBM50175099
Substrate/Competitorn/a
Meas. Tech.ChEMBL_326962 (CHEMBL853297)
IC50 57±n/a nM
Citation Shi, YZhang, JStein, PDShi, MO'Connor, SPBisaha, SNLi, CAtwal, KSBisacchi, GSSitkoff, DPudzianowski, ATLiu, ECHartl, KSSeiler, SMYoussef, SSteinbacher, TESchumacher, WARendina, ARBozarth, JMPeterson, TLZhang, GZahler, R Ketene aminal-based lactam derivatives as a novel class of orally active FXa inhibitors. Bioorg Med Chem Lett15:5453-8 (2005) 
 
Coagulation factor X
Name:Coagulation factor X
Type:Enzyme
Mol. Mass.:54726.60
Organism:Homo sapiens (Human)
Description:n/a
Residue:488
BDBM50175099
NameBDBM50175099
Synonyms:(S,Z)-3-(2-methylbenzofuran-5-ylamino)-2-(4-methylpiperidine-1-carbonyl)-3-(2-oxo-1-(2-oxo-2-(pyrrolidin-1-yl)ethyl)azepan-3-ylamino)acrylonitrile | CHEMBL200961
TypeSmall organic molecule
Emp. Form.C31H40N6O4
Mol. Mass.560.6871
SMILESCC1CCN(CC1)C(=O)C(C#N)C(N[C@H]1CCCCN(CC(=O)N2CCCC2)C1=O)=Nc1ccc2oc(C)cc2c1