Reaction Details
TargetProcathepsin L
LigandBDBM50002402
Substrate/Competitorn/a
Meas. Tech.ChEMBL_321690 (CHEMBL872185)
Ki 0.43±n/a nM
Citation Marquis, RWJames, IZeng, JTrout, REThompson, SRahman, AYamashita, DSXie, RRu, YGress, CJBlake, SLark, MAHwang, SMTomaszek, TOffen, PHead, MSCummings, MDVeber, DF Azepanone-based inhibitors of human cathepsin L. J Med Chem48:6870-8 (2005) 
 
Procathepsin L
Name:Procathepsin L
Type:Enzyme
Mol. Mass.:37557.19
Organism:Homo sapiens (Human)
Description:Purchased from Calbiochem (San Diego, CA).
Residue:333
BDBM50002402
NameBDBM50002402
Synonyms:CHEMBL194643
TypeSmall organic molecule
Emp. Form.C35H32N4O5S
Mol. Mass.620.717
SMILESO=C(N[C@H]1CCCN(CC1=O)S(=O)(=O)c1ccccn1)[C@H](Cc1ccc2ccccc2c1)NC(=O)c1cccc2ccccc12