Reaction Details
TargetCathepsin K
LigandBDBM19769
Substrate/Competitorn/a
Meas. Tech.ChEMBL_322340 (CHEMBL872683)
IC50 70±n/a nM
Citation Marquis, RWJames, IZeng, JTrout, REThompson, SRahman, AYamashita, DSXie, RRu, YGress, CJBlake, SLark, MAHwang, SMTomaszek, TOffen, PHead, MSCummings, MDVeber, DF Azepanone-based inhibitors of human cathepsin L. J Med Chem48:6870-8 (2005) 
 
Cathepsin K
Name:Cathepsin K
Type:Enzyme
Mol. Mass.:36975.68
Organism:Homo sapiens (Human)
Description:P43235
Residue:329
BDBM19769
NameBDBM19769
Synonyms:(2S)-2-(1-benzofuran-2-ylformamido)-4-methyl-N-[(4S)-3-oxo-1-(pyridine-2-sulfonyl)azepan-4-yl]pentanamide CHEMBL286364
TypeSmall organic molecule
Emp. Form.C26H30N4O6S
Mol. Mass.526.605
SMILESCC(C)C[C@H](NC(=O)c1cc2ccccc2o1)C(=O)N[C@H]1CCCN(CC1=O)S(=O)(=O)c1ccccn1