Reaction Details
TargetCaspase-1
LigandBDBM50176495
Substrate/Competitorn/a
Meas. Tech.ChEMBL_332180 (CHEMBL869995)
Ki 5±n/a nM
Citation Fahr, BTO'Brien, TPham, PWaal, NDBaskaran, SRaimundo, BCLam, JWSopko, MMPurkey, HERomanowski, MJ Tethering identifies fragment that yields potent inhibitors of human caspase-1. Bioorg Med Chem Lett16:559-62 (2005) 
 
Caspase-1
Name:Caspase-1
Type:Enzyme
Mol. Mass.:45154.13
Organism:Homo sapiens (Human)
Description:P29466
Residue:404
BDBM50176495
NameBDBM50176495
Synonyms:(3S)-4-oxo-3-(2-phenyl-6-(4-(quinoxalin-2-ylamino)benzamido)hexanamido)butanoic acid | CHEMBL444088
TypeSmall organic molecule
Emp. Form.C31H31N5O5
Mol. Mass.553.6083
SMILESOC(=O)C[C@H](NC(=O)C(CCCCNC(=O)c1ccc(Nc2cnc3ccccc3n2)cc1)c1ccccc1)C=O