Reaction Details
TargetCaspase-1
LigandBDBM50176505
Substrate/Competitorn/a
Meas. Tech.ChEMBL_332180 (CHEMBL869995)
Ki 16±n/a nM
Citation Fahr, BTO'Brien, TPham, PWaal, NDBaskaran, SRaimundo, BCLam, JWSopko, MMPurkey, HERomanowski, MJ Tethering identifies fragment that yields potent inhibitors of human caspase-1. Bioorg Med Chem Lett16:559-62 (2005) 
 
Caspase-1
Name:Caspase-1
Type:Enzyme
Mol. Mass.:45154.13
Organism:Homo sapiens (Human)
Description:P29466
Residue:404
BDBM50176505
NameBDBM50176505
Synonyms:(3S)-3-(2-ethyl-6-(4-(quinoxalin-2-ylamino)benzamido)hexanamido)-4-oxobutanoic acid | CHEMBL202571
TypeSmall organic molecule
Emp. Form.C27H31N5O5
Mol. Mass.505.5655
SMILESCCC(CCCCNC(=O)c1ccc(Nc2cnc3ccccc3n2)cc1)C(=O)N[C@@H](CC(O)=O)C=O