Reaction Details
TargetDynamin-1
LigandBDBM50177941
Substrate/Competitorn/a
Meas. Tech.ChEMBL_326472 (CHEMBL864467)
IC50 1700±n/a nM
Citation Hill, TOdell, LREdwards, JKGraham, MEMcGeachie, ABRusak, JQuan, AAbagyan, RScott, JLRobinson, PJMcCluskey, A Small molecule inhibitors of dynamin I GTPase activity: development of dimeric tyrphostins. J Med Chem48:7781-8 (2005) 
 
Dynamin-1
Name:Dynamin-1
Type:PROTEIN
Mol. Mass.:97411.67
Organism:Homo sapiens (Human)
Description:ChEMBL_1458576
Residue:864
BDBM50177941
NameBDBM50177941
Synonyms:2-cyano-N-{3-[2-cyano-3-(3,4,5-trihydroxyphenyl)acryloylamino]ethyl}-3-(3,4,5-trihydroxyphenyl)acrylamide | CHEMBL198466
TypeSmall organic molecule
Emp. Form.C22H18N4O8
Mol. Mass.466.4003
SMILESOc1cc(\C=C(/C#N)C(=O)NCCNC(=O)C(=C\c2cc(O)c(O)c(O)c2)\C#N)cc(O)c1O