Reaction Details
TargetVasopressin V2 receptor
LigandBDBM35723
Substrate/Competitorn/a
Meas. Tech.ChEMBL_2234600 (CHEMBL5148372)
Ki 2.4±n/a nM
Citation Cao, XWang, PYuan, HZhang, HHe, YFu, KFang, QLiu, HSu, LYin, LXu, PXie, YXiong, XWang, JZhu, XGuo, D Benzodiazepine Derivatives as Potent Vasopressin V J Med Chem65:9295-9311 (2022) 
 
Vasopressin V2 receptor
Name:Vasopressin V2 receptor
Type:Receptor
Mol. Mass.:40295.28
Organism:Homo sapiens (Human)
Description:P30518
Residue:371
BDBM35723
NameBDBM35723
Synonyms:CHEMBL344159 TOLVAPTAN | benzazepine derivative, 32
TypeSmall organic molecule
Emp. Form.C26H25ClN2O3
Mol. Mass.448.941
SMILESCc1ccccc1C(=O)Nc1ccc(C(=O)N2CCCC(O)c3cc(Cl)ccc23)c(C)c1