Reaction Details
TargetCytosolic phospholipase A2
LigandBDBM50136730
Substrate/Competitorn/a
Meas. Tech.ChEMBL_330030 (CHEMBL853015)
IC50 160000±n/a nM
Citation McKew, JCFoley, MAThakker, PBehnke, MLLovering, FESum, FWTam, SWu, KShen, MWZhang, WGonzalez, MLiu, SMahadevan, ASard, HKhor, SPClark, JD Inhibition of cytosolic phospholipase A2alpha: hit to lead optimization. J Med Chem49:135-58 (2006) 
 
Cytosolic phospholipase A2
Name:Cytosolic phospholipase A2
Type:Protein
Mol. Mass.:85219.30
Organism:Homo sapiens (Human)
Description:P47712
Residue:749
BDBM50136730
NameBDBM50136730
Synonyms:4-((1-benzhydryl-6-chloro-1H-indol-3-yl)methyl)-3-methoxybenzoic acid CHEMBL139858
TypeSmall organic molecule
Emp. Form.C30H24ClNO3
Mol. Mass.481.969
SMILESCOc1cc(ccc1Cc1cn(C(c2ccccc2)c2ccccc2)c2cc(Cl)ccc12)C(O)=O