Reaction Details
TargetGrowth hormone secretagogue receptor type 1
LigandBDBM50181217
Substrate/Competitorn/a
Meas. Tech.ChEMBL_345662 (CHEMBL870659)
IC50 2.5±n/a nM
Citation Liu, BLiu, MXin, ZZhao, HSerby, MDKosogof, CNelson, LTSzczepankiewicz, BGKaszubska, WSchaefer, VGFalls, HDLin, CWCollins, CASham, HLLiu, G Optimization of 2,4-diaminopyrimidines as GHS-R antagonists: side chain exploration. Bioorg Med Chem Lett16:1864-8 (2006) 
 
Growth hormone secretagogue receptor type 1
Name:Growth hormone secretagogue receptor type 1
Type:Receptor
Mol. Mass.:41334.57
Organism:Homo sapiens (Human)
Description:Receptor binding studies use plasma membranes from LLC PK-1 cells transiently transfected with hGHSR1a.
Residue:366
BDBM50181217
NameBDBM50181217
Synonyms:5-(4-(4-(methylsulfonyl)benzylamino)phenyl)-6-((methyl(phenyl)amino)methyl)pyrimidine-2,4-diamine | CHEMBL383411
TypeSmall organic molecule
Emp. Form.C26H28N6O2S
Mol. Mass.488.605
SMILESCN(Cc1nc(N)nc(N)c1-c1ccc(NCc2ccc(cc2)S(C)(=O)=O)cc1)c1ccccc1