Reaction Details
TargetGrowth hormone secretagogue receptor type 1
LigandBDBM50181229
Substrate/Competitorn/a
Meas. Tech.ChEMBL_345662 (CHEMBL870659)
IC50 3.4±n/a nM
Citation Liu, BLiu, MXin, ZZhao, HSerby, MDKosogof, CNelson, LTSzczepankiewicz, BGKaszubska, WSchaefer, VGFalls, HDLin, CWCollins, CASham, HLLiu, G Optimization of 2,4-diaminopyrimidines as GHS-R antagonists: side chain exploration. Bioorg Med Chem Lett16:1864-8 (2006) 
 
Growth hormone secretagogue receptor type 1
Name:Growth hormone secretagogue receptor type 1
Type:Receptor
Mol. Mass.:41334.57
Organism:Homo sapiens (Human)
Description:Receptor binding studies use plasma membranes from LLC PK-1 cells transiently transfected with hGHSR1a.
Residue:366
BDBM50181229
NameBDBM50181229
Synonyms:5-[4-(4-methanesulfonyl-benzylamino)-phenyl]-6-(5-methyl-furan-2-ylmethoxymethyl)-pyrimidine-2,4-diamine | CHEMBL206741
TypeSmall organic molecule
Emp. Form.C25H27N5O4S
Mol. Mass.493.578
SMILESCc1ccc(COCc2nc(N)nc(N)c2-c2ccc(NCc3ccc(cc3)S(C)(=O)=O)cc2)o1