Reaction Details
TargetProteasome subunit beta type-8
LigandBDBM50601642
Substrate/Competitorn/a
Meas. Tech.ChEMBL_2237803 (CHEMBL5151699)
IC50 1.7±n/a nM
Citation Klein, MBusch, MFriese-Hamim, MCrosignani, SFuchss, TMusil, DRohdich, FSanderson, MPSeenisamy, JWalter-Bausch, GZanelli, UHewitt, PEsdar, CSchadt, O Structure-Based Optimization and Discovery of M3258, a Specific Inhibitor of the Immunoproteasome Subunit LMP7 (?5i). J Med Chem64:10230-10245 (2021) 
 
Proteasome subunit beta type-8
Name:Proteasome subunit beta type-8
Type:PROTEIN
Mol. Mass.:30357.49
Organism:Homo sapiens (Human)
Description:ChEMBL_1446797
Residue:276
BDBM50601642
NameBDBM50601642
Synonyms:CHEMBL5188533
TypeSmall organic molecule
Emp. Form.C24H27BN4O4
Mol. Mass.446.307
SMILESCCc1cccc(C[C@H](NC(=O)[C@H](Cc2ccccc2)NC(=O)c2cnccn2)B(O)O)c1