Reaction Details
TargetProteasome subunit beta type-8
LigandBDBM388435
Substrate/Competitorn/a
Meas. Tech.ChEMBL_2237803 (CHEMBL5151699)
IC50 1.8±n/a nM
Citation Klein, MBusch, MFriese-Hamim, MCrosignani, SFuchss, TMusil, DRohdich, FSanderson, MPSeenisamy, JWalter-Bausch, GZanelli, UHewitt, PEsdar, CSchadt, O Structure-Based Optimization and Discovery of M3258, a Specific Inhibitor of the Immunoproteasome Subunit LMP7 (?5i). J Med Chem64:10230-10245 (2021) 
 
Proteasome subunit beta type-8
Name:Proteasome subunit beta type-8
Type:PROTEIN
Mol. Mass.:30357.49
Organism:Homo sapiens (Human)
Description:ChEMBL_1446797
Residue:276
BDBM388435
NameBDBM388435
Synonyms:US10294246, Compound No. 132
TypeSmall organic molecule
Emp. Form.C18H19BClNO4
Mol. Mass.359.612
SMILESOB(O)[C@H](C[C@@H]1COc2c1cccc2Cl)NC(=O)Cc1ccccc1