Reaction Details
TargetProteasome subunit beta type-8
LigandBDBM388321
Substrate/Competitorn/a
Meas. Tech.ChEMBL_2237803 (CHEMBL5151699)
IC50 1.9±n/a nM
Citation Klein, MBusch, MFriese-Hamim, MCrosignani, SFuchss, TMusil, DRohdich, FSanderson, MPSeenisamy, JWalter-Bausch, GZanelli, UHewitt, PEsdar, CSchadt, O Structure-Based Optimization and Discovery of M3258, a Specific Inhibitor of the Immunoproteasome Subunit LMP7 (?5i). J Med Chem64:10230-10245 (2021) 
 
Proteasome subunit beta type-8
Name:Proteasome subunit beta type-8
Type:PROTEIN
Mol. Mass.:30357.49
Organism:Homo sapiens (Human)
Description:ChEMBL_1446797
Residue:276
BDBM388321
NameBDBM388321
Synonyms:US10294246, Compound No. 18
TypeSmall organic molecule
Emp. Form.C16H16BN3O4
Mol. Mass.325.127
SMILESOB(O)[C@H](Cc1coc2ccccc12)NC(=O)Cc1cnccn1