Reaction Details
TargetProteasome subunit beta type-8
LigandBDBM388437
Substrate/Competitorn/a
Meas. Tech.ChEMBL_2237803 (CHEMBL5151699)
IC50 2.9±n/a nM
Citation Klein, MBusch, MFriese-Hamim, MCrosignani, SFuchss, TMusil, DRohdich, FSanderson, MPSeenisamy, JWalter-Bausch, GZanelli, UHewitt, PEsdar, CSchadt, O Structure-Based Optimization and Discovery of M3258, a Specific Inhibitor of the Immunoproteasome Subunit LMP7 (?5i). J Med Chem64:10230-10245 (2021) 
 
Proteasome subunit beta type-8
Name:Proteasome subunit beta type-8
Type:PROTEIN
Mol. Mass.:30357.49
Organism:Homo sapiens (Human)
Description:ChEMBL_1446797
Residue:276
BDBM388437
NameBDBM388437
Synonyms:US10294246, Compound No. 134
TypeSmall organic molecule
Emp. Form.C19H18BClN2O4
Mol. Mass.384.621
SMILESOB(O)[C@H](C[C@@H]1COc2c1cccc2Cl)NC(=O)Cc1ccccc1C#N