Reaction Details
TargetProteasome subunit beta type-8
LigandBDBM50601643
Substrate/Competitorn/a
Meas. Tech.ChEMBL_2237803 (CHEMBL5151699)
IC50 3.6±n/a nM
Citation Klein, MBusch, MFriese-Hamim, MCrosignani, SFuchss, TMusil, DRohdich, FSanderson, MPSeenisamy, JWalter-Bausch, GZanelli, UHewitt, PEsdar, CSchadt, O Structure-Based Optimization and Discovery of M3258, a Specific Inhibitor of the Immunoproteasome Subunit LMP7 (?5i). J Med Chem64:10230-10245 (2021) 
 
Proteasome subunit beta type-8
Name:Proteasome subunit beta type-8
Type:PROTEIN
Mol. Mass.:30357.49
Organism:Homo sapiens (Human)
Description:ChEMBL_1446797
Residue:276
BDBM50601643
NameBDBM50601643
Synonyms:CHEMBL5184466
TypeSmall organic molecule
Emp. Form.C17H20BNO5
Mol. Mass.329.155
SMILES[H][C@]12CC[C@]([H])(O1)[C@@H](C2)C(=O)N[C@@H](Cc1coc2ccccc12)B(O)O